Target
Thromboxane A2 receptor
Ligand
BDBM50312906
Substrate
Meas. Tech.
ChEMBL_615905 (CHEMBL1102919)
IC50
31000±n/a nM
Citation
 Grimstrup, MReceveur, JMRist, ØFrimurer, TMNielsen, PAMathiesen, JMHögberg, T Exploration of SAR features by modifications of thiazoleacetic acids as CRTH2 antagonists. Bioorg Med Chem Lett 20:1638-41 (2010)  
Target
Name:
Thromboxane A2 receptor
Synonyms:
Prostanoid TP receptor TBXA2R Thromboxane Thromboxane Beta
Type:
Enyzme
Mol. Mass.:
37445.28
Organism:
Homo sapiens (Human)
Description:
P21731
Residue:
343
  
Inhibitor
Name:
BDBM50312906
Synonyms:
2-(2-(bis(4-fluorophenyl)methyl)-4-(3-fluorophenyl)pyrimidin-5-yl)acetic acid | CHEMBL1088284
Type:
Small organic molecule
Emp. Form.:
C25H17F3N2O2
Mol. Mass.:
434.4099
SMILES:
OC(=O)Cc1cnc(nc1-c1cccc(F)c1)C(c1ccc(F)cc1)c1ccc(F)cc1
: