Target
Bombesin receptor subtype-3
Ligand
BDBM50314969
Substrate
Meas. Tech.
ChEMBL_627762 (CHEMBL1116184)
EC50
99±n/a nM
Citation
 Liu, JHe, SJian, TDobbelaar, PHSebhat, IKLin, LSGoodman, AGuo, CGuzzo, PRHadden, MHenderson, AJPattamana, KRuenz, MSargent, BJSwenson, BYet, LTamvakopoulos, CPeng, QPan, JKan, YPalyha, OKelly, TMGuan, XMHoward, ADMarsh, DJMetzger, JMReitman, MLWyvratt, MJNargund, RP Synthesis and SAR of derivatives based on 2-biarylethylimidazole as bombesin receptor subtype-3 (BRS-3) agonists for the treatment of obesity. Bioorg Med Chem Lett 20:2074-7 (2010)  
Target
Name:
Bombesin receptor subtype-3
Synonyms:
BRS-3 BRS3_HUMAN Bombesin like receptor 3
Type:
Enzyme Catalytic Domain
Mol. Mass.:
44424.45
Organism:
Homo sapiens (Human)
Description:
Bombesin 3 BRS3 HUMAN::P32247
Residue:
399
  
Inhibitor
Name:
BDBM50314969
Synonyms:
2-(4-(2-(4-(2,2-dimethylbutyl)-1H-imidazol-2-yl)ethyl)phenyl)pyridine | CHEMBL1091720
Type:
Small organic molecule
Emp. Form.:
C22H27N3
Mol. Mass.:
333.4699
SMILES:
CCC(C)(C)Cc1cnc(CCc2ccc(cc2)-c2ccccn2)[nH]1
: