Target
Melatonin receptor type 1A
Ligand
BDBM50315171
Substrate
Meas. Tech.
ChEMBL_624959 (CHEMBL1107082)
Ki
441±n/a nM
Citation
 Hu, YHo, MKChan, KHNew, DCWong, YH Synthesis of substituted N-[3-(3-methoxyphenyl)propyl] amides as highly potent MT(2)-selective melatonin ligands. Bioorg Med Chem Lett 20:2582-5 (2010)  
Target
Name:
Melatonin receptor type 1A
Synonyms:
MTNR1A MTR1A_HUMAN Mel1a melatonin receptor Melatonin receptor Melatonin receptor type 1 (MT1) | Melatonin receptor type 1A
Type:
Enzyme
Mol. Mass.:
39392.94
Organism:
Homo sapiens (Human)
Description:
P48039
Residue:
350
  
Inhibitor
Name:
BDBM50315171
Synonyms:
CHEMBL1092646 | N-(3-(5-methoxy-2-(3-methoxybenzyloxy)phenyl)propyl)acetamide
Type:
Small organic molecule
Emp. Form.:
C20H25NO4
Mol. Mass.:
343.4168
SMILES:
COc1cccc(COc2ccc(OC)cc2CCCNC(C)=O)c1
: