Target
6,7-dimethyl-8-ribityllumazine synthase
Ligand
BDBM50316578
Substrate
Meas. Tech.
ChEMBL_631473 (CHEMBL1114707)
Ki
434000±n/a nM
Citation
 Talukdar, AMorgunova, EDuan, JMeining, WFoloppe, NNilsson, LBacher, AIllarionov, BFischer, MLadenstein, RCushman, M Virtual screening, selection and development of a benzindolone structural scaffold for inhibition of lumazine synthase. Bioorg Med Chem 18:3518-34 (2010)  
Target
Name:
6,7-dimethyl-8-ribityllumazine synthase
Synonyms:
RISB_MYCTU | ribH
Type:
PROTEIN
Mol. Mass.:
16367.39
Organism:
Mycobacterium tuberculosis
Description:
ChEMBL_631469
Residue:
160
  
Inhibitor
Name:
BDBM50316578
Synonyms:
3-(2-Oxo-1,2-dihydrobenzo[cd]indole-6-sulfonamido)propyl dihydrogen phosphate | CHEMBL1097476
Type:
Small organic molecule
Emp. Form.:
C14H15N2O7PS
Mol. Mass.:
386.317
SMILES:
OP(O)(=O)OCCCNS(=O)(=O)c1ccc2NC(=O)c3cccc1c23
: