Target
Sphingosine 1-phosphate receptor 1
Ligand
BDBM50316769
Substrate
Meas. Tech.
ChEMBL_632481 (CHEMBL1108345)
EC50
9.1±n/a nM
Citation
 Bolli, MHAbele, SBinkert, CBravo, RBuchmann, SBur, DGatfield, JHess, PKohl, CMangold, CMathys, BMenyhart, KMüller, CNayler, OScherz, MSchmidt, GSippel, VSteiner, BStrasser, DTreiber, AWeller, T 2-imino-thiazolidin-4-one derivatives as potent, orally active S1P1 receptor agonists. J Med Chem 53:4198-211 (2010)  
Target
Name:
Sphingosine 1-phosphate receptor 1
Synonyms:
CHEDG1 Endothelial differentiation G-protein coupled receptor 1 S1P1 S1PR1_HUMAN Sphingosine 1-phosphate receptor Edg-1
Type:
Enzyme
Mol. Mass.:
42836.02
Organism:
Homo sapiens (Human)
Description:
P21453
Residue:
382
  
Inhibitor
Name:
BDBM50316769
Synonyms:
(Z,Z)-5-[3-Chloro-4-((2R)-2,3-dihydroxy-propoxy)-benzylidene]-2-propylimino-3-o-tolyl-thiazolidin-4-one | CHEMBL1095833
Type:
Small organic molecule
Emp. Form.:
C23H25ClN2O4S
Mol. Mass.:
460.974
SMILES:
CCC\N=C1/S\C(=C/c2ccc(OC[C@@H](O)CO)c(Cl)c2)C(=O)N1c1ccccc1C
: