Target
Sphingosine 1-phosphate receptor 5
Ligand
BDBM50316769
Substrate
Meas. Tech.
ChEMBL_632516 (CHEMBL1111164)
IC50
142±n/a nM
Citation
 Bolli, MHAbele, SBinkert, CBravo, RBuchmann, SBur, DGatfield, JHess, PKohl, CMangold, CMathys, BMenyhart, KMüller, CNayler, OScherz, MSchmidt, GSippel, VSteiner, BStrasser, DTreiber, AWeller, T 2-imino-thiazolidin-4-one derivatives as potent, orally active S1P1 receptor agonists. J Med Chem 53:4198-211 (2010)  
Target
Name:
Sphingosine 1-phosphate receptor 5
Synonyms:
EDG8 S1P5 S1PR5_HUMAN Sphingosine 1-phosphate receptor Edg-8
Type:
G Protein-Coupled Receptor (GPCR)
Mol. Mass.:
41796.42
Organism:
Homo sapiens (Human)
Description:
Residue:
398
  
Inhibitor
Name:
BDBM50316769
Synonyms:
(Z,Z)-5-[3-Chloro-4-((2R)-2,3-dihydroxy-propoxy)-benzylidene]-2-propylimino-3-o-tolyl-thiazolidin-4-one | CHEMBL1095833
Type:
Small organic molecule
Emp. Form.:
C23H25ClN2O4S
Mol. Mass.:
460.974
SMILES:
CCC\N=C1/S\C(=C/c2ccc(OC[C@@H](O)CO)c(Cl)c2)C(=O)N1c1ccccc1C
: