Target
Sphingosine 1-phosphate receptor 3
Ligand
BDBM50316725
Substrate
Meas. Tech.
ChEMBL_632482 (CHEMBL1108346)
EC50
50±n/a nM
Citation
 Bolli, MHAbele, SBinkert, CBravo, RBuchmann, SBur, DGatfield, JHess, PKohl, CMangold, CMathys, BMenyhart, KMüller, CNayler, OScherz, MSchmidt, GSippel, VSteiner, BStrasser, DTreiber, AWeller, T 2-imino-thiazolidin-4-one derivatives as potent, orally active S1P1 receptor agonists. J Med Chem 53:4198-211 (2010)  
Target
Name:
Sphingosine 1-phosphate receptor 3
Synonyms:
C9orf108 EDG3 S1P receptor 3 S1P3 S1PR3_HUMAN Sphingosine 1-phosphate receptor 3 (S1P3) | Sphingosine 1-phosphate receptor Edg-3
Type:
G Protein-Coupled Receptor (GPCR)
Mol. Mass.:
42278.13
Organism:
Homo sapiens (Human)
Description:
Q99500
Residue:
378
  
Inhibitor
Name:
BDBM50316725
Synonyms:
(Z,Z)-5-(4-Hydroxy-3-methyl-benzylidene)-2-isopropylimino-3-phenyl-thiazolidin-4-one | CHEMBL1095995
Type:
Small organic molecule
Emp. Form.:
C20H20N2O2S
Mol. Mass.:
352.45
SMILES:
CC(C)\N=C1/S\C(=C/c2ccc(O)c(C)c2)C(=O)N1c1ccccc1
: