Target
Thymidine kinase
Ligand
BDBM50002692
Substrate
Meas. Tech.
ChEMBL_632671 (CHEMBL1112809)
IC50
12500±n/a nM
Citation
 Lin, JRoy, VWang, LYou, LAgrofoglio, LADeville-Bonne, DMcBrayer, TRCoats, SJSchinazi, RFEriksson, S 3'-(1,2,3-Triazol-1-yl)-3'-deoxythymidine analogs as substrates for human and Ureaplasma parvum thymidine kinase for structure-activity investigations. Bioorg Med Chem 18:3261-9 (2010)  
Target
Name:
Thymidine kinase
Synonyms:
KITH_UREPA | tdk
Type:
PROTEIN
Mol. Mass.:
25374.94
Organism:
Ureaplasma parvum
Description:
ChEMBL_632671
Residue:
223
  
Inhibitor
Name:
BDBM50002692
Synonyms:
(AZT) 1-(4-Azido-5-hydroxymethyl-tetrahydro-furan-2-yl)-5-methyl-1H-pyrimidine-2,4-dione 1-((2R,4R,5S)-4-azido-5-(hydroxymethyl)tetrahydrofuran-2-yl)-5-methylpyrimidine-2,4(1H,3H)-dione 1-((2R,4S,5S)-4-Azido-5-hydroxymethyl-tetrahydro-furan-2-yl)-5-methyl-1H-pyrimidine-2,4-dione 1-((2R,4S,5S)-4-azido-5-(hydroxymethyl)tetrahydrofuran-2-yl)-5-methylpyrimidine-2,4(1H,3H)-dione 1-((2S,4R,5R)-4-Azido-5-hydroxymethyl-tetrahydro-furan-2-yl)-5-methyl-1H-pyrimidine-2,4-dione 1-(4-Azido-5-hydroxymethyl-tetrahydro-furan-2-yl)-5-methyl-1H-pyrimidine-2,4-dione (AZT) 1-(4-Azido-5-hydroxymethyl-tetrahydro-furan-2-yl)-5-methyl-1H-pyrimidine-2,4-dione (N3ddThd) 1-(4-Azido-5-hydroxymethyl-tetrahydro-furan-2-yl)-5-methyl-1H-pyrimidine-2,4-dione(3'-azido-2',3'-dideoxythymidine) 1-(4-Azido-5-hydroxymethyl-tetrahydro-furan-2-yl)-5-methyl-1H-pyrimidine-2,4-dione(Zidovudine, AZT) 3'-Azido-3'-deoxy-thymidine 3'-azido-2',3'-dideoxythymidine 3'azido-2'3'-dideoxythymidine 4-(4-Azido-5-hydroxy-tetrahydro-furan-2-yl)-5-methyl-3H-pyrazine-2,6-dione BW-A-509U CHEMBL129 US10071110, Compound AZT ZIDOVUDINE zidovudin | zudovidine
Type:
Small organic molecule
Emp. Form.:
C10H13N5O4
Mol. Mass.:
267.2413
SMILES:
Cc1cn([C@H]2C[C@H](N=[N+]=[N-])[C@@H](CO)O2)c(=O)[nH]c1=O
: