Target
Prostaglandin E2 receptor EP4 subtype
Ligand
BDBM50317896
Substrate
Meas. Tech.
ChEMBL_630200 (CHEMBL1117303)
Ki
460±n/a nM
Citation
 Asada, MObitsu, TKinoshita, ANagase, TYoshida, TYamaura, YTakizawa, HYoshikawa, KSato, KNarita, MNakai, HToda, MTobe, Y 3-(2-Aminocarbonylphenyl)propanoic acid analogs as potent and selective EP3 receptor antagonists. Part 3: Synthesis, metabolic stability, and biological evaluation of optically active analogs. Bioorg Med Chem 18:3212-23 (2010)  
Target
Name:
Prostaglandin E2 receptor EP4 subtype
Synonyms:
PE2R4_MOUSE Prostanoid EP4 receptor Ptgerep4
Type:
G-protein coupled receptor
Mol. Mass.:
56175.66
Organism:
Mus musculus (Mouse)
Description:
Residue:
513
  
Inhibitor
Name:
BDBM50317896
Synonyms:
3-{2-({[(1R)-1-(3,5-Dimethylphenyl)-3-methylbutyl]-amino}carbonyl)-4-[(pyridin-3-yloxy)methyl]phenyl}propanoicacid | CHEMBL1094814
Type:
Small organic molecule
Emp. Form.:
C29H34N2O4
Mol. Mass.:
474.5913
SMILES:
CC(C)C[C@@H](NC(=O)c1cc(COc2cccnc2)ccc1CCC(O)=O)c1cc(C)cc(C)c1
: