Target
Prostaglandin E2 receptor EP4 subtype
Ligand
BDBM50317900
Substrate
Meas. Tech.
ChEMBL_630200 (CHEMBL1117303)
Ki
410±n/a nM
Citation
 Asada, MObitsu, TKinoshita, ANagase, TYoshida, TYamaura, YTakizawa, HYoshikawa, KSato, KNarita, MNakai, HToda, MTobe, Y 3-(2-Aminocarbonylphenyl)propanoic acid analogs as potent and selective EP3 receptor antagonists. Part 3: Synthesis, metabolic stability, and biological evaluation of optically active analogs. Bioorg Med Chem 18:3212-23 (2010)  
Target
Name:
Prostaglandin E2 receptor EP4 subtype
Synonyms:
PE2R4_MOUSE Prostanoid EP4 receptor Ptgerep4
Type:
G-protein coupled receptor
Mol. Mass.:
56175.66
Organism:
Mus musculus (Mouse)
Description:
Residue:
513
  
Inhibitor
Name:
BDBM50317900
Synonyms:
3-[4-(3,5-Difluorophenoxy)-2-({[(1R)-1-(3,5-dimethylphenyl)-3-methylbutyl]amino}carbonyl)phenyl]propanoic acid | CHEMBL1095117
Type:
Small organic molecule
Emp. Form.:
C29H31F2NO4
Mol. Mass.:
495.5575
SMILES:
CC(C)C[C@@H](NC(=O)c1cc(Oc2cc(F)cc(F)c2)ccc1CCC(O)=O)c1cc(C)cc(C)c1
: