Target
Prostaglandin E2 receptor EP3 subtype
Ligand
BDBM50317902
Substrate
Meas. Tech.
ChEMBL_630199 (CHEMBL1117302)
Ki
0.28±n/a nM
Citation
 Asada, MObitsu, TKinoshita, ANagase, TYoshida, TYamaura, YTakizawa, HYoshikawa, KSato, KNarita, MNakai, HToda, MTobe, Y 3-(2-Aminocarbonylphenyl)propanoic acid analogs as potent and selective EP3 receptor antagonists. Part 3: Synthesis, metabolic stability, and biological evaluation of optically active analogs. Bioorg Med Chem 18:3212-23 (2010)  
Target
Name:
Prostaglandin E2 receptor EP3 subtype
Synonyms:
PE2R3_MOUSE Prostaglandin E2 receptor EP3 isoform alpha Prostanoid EP3 receptor Ptgerep3
Type:
G-protein coupled receptor
Mol. Mass.:
40092.50
Organism:
Mus musculus (Mouse)
Description:
Residue:
365
  
Inhibitor
Name:
BDBM50317902
Synonyms:
3-[4-(3-Cyanophenoxy)-2-({[(1R)-1-(3,5-dimethylphenyl)-3-methylbutyl]amino}carbonyl)phenyl]propanoic acid | CHEMBL1095065
Type:
Small organic molecule
Emp. Form.:
C30H32N2O4
Mol. Mass.:
484.5861
SMILES:
CC(C)C[C@@H](NC(=O)c1cc(Oc2cccc(c2)C#N)ccc1CCC(O)=O)c1cc(C)cc(C)c1
: