Target
Prostaglandin E2 receptor EP3 subtype
Ligand
BDBM50317907
Substrate
Meas. Tech.
ChEMBL_630199 (CHEMBL1117302)
Ki
0.16±n/a nM
Citation
 Asada, MObitsu, TKinoshita, ANagase, TYoshida, TYamaura, YTakizawa, HYoshikawa, KSato, KNarita, MNakai, HToda, MTobe, Y 3-(2-Aminocarbonylphenyl)propanoic acid analogs as potent and selective EP3 receptor antagonists. Part 3: Synthesis, metabolic stability, and biological evaluation of optically active analogs. Bioorg Med Chem 18:3212-23 (2010)  
Target
Name:
Prostaglandin E2 receptor EP3 subtype
Synonyms:
PE2R3_MOUSE Prostaglandin E2 receptor EP3 isoform alpha Prostanoid EP3 receptor Ptgerep3
Type:
G-protein coupled receptor
Mol. Mass.:
40092.50
Organism:
Mus musculus (Mouse)
Description:
Residue:
365
  
Inhibitor
Name:
BDBM50317907
Synonyms:
3-[4-[(3-Chlorophenoxy)methyl]-2-({[(1R)-1-(3,5-dimethylphenyl)-3-methylbutyl]amino}carbonyl)phenyl]propanoicacid | CHEMBL1094156
Type:
Small organic molecule
Emp. Form.:
C30H34ClNO4
Mol. Mass.:
508.048
SMILES:
CC(C)C[C@@H](NC(=O)c1cc(COc2cccc(Cl)c2)ccc1CCC(O)=O)c1cc(C)cc(C)c1
: