Target
Histone deacetylase 2
Ligand
BDBM50317993
Substrate
Meas. Tech.
ChEMBL_630931 (CHEMBL1116530)
IC50
10000±n/a nM
Citation
 Bressi, JCJennings, AJSkene, RWu, YMelkus, RDe Jong, RO'Connell, SGrimshaw, CENavre, MGangloff, AR Exploration of the HDAC2 foot pocket: Synthesis and SAR of substituted N-(2-aminophenyl)benzamides. Bioorg Med Chem Lett 20:3142-5 (2010)  
Target
Name:
Histone deacetylase 2
Synonyms:
Cereblon/Histone deacetylase 2 HDAC2 Histone deacetylase 2 (HDAC2) | Human HDAC2
Type:
Chromatin regulator; hydrolase; repressor
Mol. Mass.:
55356.54
Organism:
Homo sapiens (Human)
Description:
Q92769
Residue:
488
  
Inhibitor
Name:
BDBM50317993
Synonyms:
CHEMBL1097745 | N-(2-amino-5-(benzo[b]thiophen-3-yl)phenyl)benzamide
Type:
Small organic molecule
Emp. Form.:
C21H16N2OS
Mol. Mass.:
344.43
SMILES:
Nc1ccc(cc1NC(=O)c1ccccc1)-c1csc2ccccc12
: