Target
Histone deacetylase 2
Ligand
BDBM50317988
Substrate
Meas. Tech.
ChEMBL_630930 (CHEMBL1116529)
IC50
1400±n/a nM
Citation
 Bressi, JCJennings, AJSkene, RWu, YMelkus, RDe Jong, RO'Connell, SGrimshaw, CENavre, MGangloff, AR Exploration of the HDAC2 foot pocket: Synthesis and SAR of substituted N-(2-aminophenyl)benzamides. Bioorg Med Chem Lett 20:3142-5 (2010)  
Target
Name:
Histone deacetylase 2
Synonyms:
Cereblon/Histone deacetylase 2 HDAC2 Histone deacetylase 2 (HDAC2) | Human HDAC2
Type:
Chromatin regulator; hydrolase; repressor
Mol. Mass.:
55356.54
Organism:
Homo sapiens (Human)
Description:
Q92769
Residue:
488
  
Inhibitor
Name:
BDBM50317988
Synonyms:
CHEMBL1098337 | N-(4-amino-4'-fluorobiphenyl-3-yl)benzamide
Type:
Small organic molecule
Emp. Form.:
C19H15FN2O
Mol. Mass.:
306.3336
SMILES:
Nc1ccc(cc1NC(=O)c1ccccc1)-c1ccc(F)cc1
: