Target
Substance-P receptor
Ligand
BDBM50318921
Substrate
Meas. Tech.
ChEMBL_635273 (CHEMBL1118377)
Ki
2.27±n/a nM
Citation
 Peters, JUHoffmann, TSchnider, PStadler, HKoblet, AAlker, APoli, SMBallard, TMSpooren, WSteward, LSleight, AJ Discovery of potent, balanced and orally active dual NK1/NK3 receptor ligands. Bioorg Med Chem Lett 20:3405-8 (2010)  
Target
Name:
Substance-P receptor
Synonyms:
NK-1 receptor NK1 Receptor NK1R_HUMAN Neurokinin-1 (NK-1) SPR TACR1 Tachykinin receptor 1 (NK1) | tachykinin
Type:
G Protein-Coupled Receptor (GPCR)
Mol. Mass.:
46254.43
Organism:
Homo sapiens (Human)
Description:
P25103
Residue:
407
  
Inhibitor
Name:
BDBM50318921
Synonyms:
2-(3,5-bis(trifluoromethyl)phenyl)-N-(4-(2-chlorophenyl)-6-((R)-2-(hydroxymethyl)piperidin-1-yl)pyridin-3-yl)-N,2-dimethylpropanamide | CHEMBL1084435
Type:
Small organic molecule
Emp. Form.:
C30H30ClF6N3O2
Mol. Mass.:
614.022
SMILES:
CN(C(=O)C(C)(C)c1cc(cc(c1)C(F)(F)F)C(F)(F)F)c1cnc(cc1-c1ccccc1Cl)N1CCCC[C@@H]1CO
: