Target
Extracellular calcium-sensing receptor
Ligand
BDBM50161093
Substrate
Meas. Tech.
ChEMBL_635061 (CHEMBL1119175)
IC50
26±n/a nM
Citation
 Shinagawa, YInoue, THirata, KKatsushima, TNakagawa, TMatsuo, YShindo, MHashimoto, H New aminopropandiol derivatives as orally available and short-acting calcium-sensing receptor antagonists. Bioorg Med Chem Lett 20:3809-13 (2010)  
Target
Name:
Extracellular calcium-sensing receptor
Synonyms:
CASR CaR Calcium-sensing receptor (CaSR) GPRC2A Parathyroid Cell calcium-sensing receptor Synonyms=GPRC2A | hCasR
Type:
Protein
Mol. Mass.:
120663.13
Organism:
Homo sapiens (Human)
Description:
P41180
Residue:
1078
  
Inhibitor
Name:
BDBM50161093
Synonyms:
(R)-2-chloro-6-(2-hydroxy-3-(2-methyl-1-(naphthalen-2-yl)propan-2-ylamino)propoxy)benzonitrile 2-Chloro-6-[(R)-3-(1,1-dimethyl-2-naphthalen-2-yl-ethylamino)-2-hydroxy-propoxy]-benzonitrile CHEMBL2112075
Type:
Small organic molecule
Emp. Form.:
C24H25ClN2O2
Mol. Mass.:
408.921
SMILES:
CC(C)(Cc1ccc2ccccc2c1)NC[C@@H](O)COc1cccc(Cl)c1C#N
: