Target
Smoothened homolog
Ligand
BDBM50320336
Substrate
Meas. Tech.
ChEMBL_633891 (CHEMBL1120457)
IC50
2.7±n/a nM
Citation
 Lucas, BSAaron, WAn, SAustin, RJBrown, MChan, HChong, AHungate, RHuang, TJiang, BJohnson, MGKaizerman, JALee, GMcMinn, DLOrf, JPowers, JPRong, MToteva, MMUyeda, CWickramasinghe, DXu, GYe, QZhong, W Design of 1-piperazinyl-4-arylphthalazines as potent Smoothened antagonists. Bioorg Med Chem Lett 20:3618-22 (2010)  
Target
Name:
Smoothened homolog
Synonyms:
G-protein- coupled-like receptor Smoothened (Smo) SMOH Smoothened homolog
Type:
Protein
Mol. Mass.:
86415.51
Organism:
Homo sapiens (Human)
Description:
Q99835
Residue:
787
  
Inhibitor
Name:
BDBM50320336
Synonyms:
(R)-(4-(4-(4-(hydroxymethyl)phenyl)phthalazin-1-yl)-3-methylpiperazin-1-yl)(phenyl)methanone | CHEMBL1084734
Type:
Small organic molecule
Emp. Form.:
C27H26N4O2
Mol. Mass.:
438.5209
SMILES:
C[C@@H]1CN(CCN1c1nnc(-c2ccc(CO)cc2)c2ccccc12)C(=O)c1ccccc1
: