Target
Tyrosine-protein kinase ABL1
Ligand
BDBM50320700
Substrate
Meas. Tech.
ChEMBL_638846 (CHEMBL1166970)
Ki
750±n/a nM
Citation
 Crespan, ERadi, MZanoli, SSchenone, SBotta, MMaga, G Dual Src and Abl inhibitors target wild type Abl and the AblT315I Imatinib-resistant mutant with different mechanisms. Bioorg Med Chem 18:3999-4008 (2010)  
Target
Name:
Tyrosine-protein kinase ABL1
Synonyms:
ABL ABL1_HUMAN JTK7 Proto-oncogene tyrosine-protein kinase ABL1 Tyrosine-protein kinase ABL V-abl Abelson murine leukemia viral oncogene homolog 1 p150 | tyrosine-protein kinase ABL1 isoform a
Type:
Enzyme
Mol. Mass.:
122897.30
Organism:
Homo sapiens (Human)
Description:
P00519
Residue:
1130
  
Inhibitor
Name:
BDBM50320700
Synonyms:
1-[2-chloro-2-(4-fluorophenyl)ethyl]-N-(3-fluorophenyl)-1H-pyrazolo[3,4-d]pyrimidin-4-amine | CHEMBL1165511
Type:
Small organic molecule
Emp. Form.:
C19H14ClF2N5
Mol. Mass.:
385.798
SMILES:
Fc1ccc(cc1)C(Cl)Cn1ncc2c(Nc3cccc(F)c3)ncnc12
: