Target
Histone deacetylase 1
Ligand
BDBM50320753
Substrate
Meas. Tech.
ChEMBL_639141 (CHEMBL1167402)
IC50
19000±n/a nM
Citation
 Kiyokawa, SHirata, YNagaoka, YShibano, MTaniguchi, MYasuda, MBaba, KUesato, S New orally bioavailable 2-aminobenzamide-type histone deacetylase inhibitor possessing a (2-hydroxyethyl)(4-(thiophen-2-yl)benzyl)amino group. Bioorg Med Chem 18:3925-33 (2010)  
Target
Name:
Histone deacetylase 1
Synonyms:
Cereblon/Histone deacetylase 1 HDAC1 Histone deacetylase 1 (HDAC1) RPD3L1
Type:
Enzyme
Mol. Mass.:
55090.27
Organism:
Homo sapiens (Human)
Description:
Q13547
Residue:
482
  
Inhibitor
Name:
BDBM50320753
Synonyms:
CHEMBL1163886 | N-(2-Aminophenyl)-4-((4-chlorobenzylthio)methyl)benzamide
Type:
Small organic molecule
Emp. Form.:
C21H19ClN2OS
Mol. Mass.:
382.906
SMILES:
Nc1ccccc1NC(=O)c1ccc(CSCc2ccc(Cl)cc2)cc1
: