Target
Histone deacetylase 1
Ligand
BDBM50320762
Substrate
Meas. Tech.
ChEMBL_639141 (CHEMBL1167402)
IC50
700±n/a nM
Citation
 Kiyokawa, SHirata, YNagaoka, YShibano, MTaniguchi, MYasuda, MBaba, KUesato, S New orally bioavailable 2-aminobenzamide-type histone deacetylase inhibitor possessing a (2-hydroxyethyl)(4-(thiophen-2-yl)benzyl)amino group. Bioorg Med Chem 18:3925-33 (2010)  
Target
Name:
Histone deacetylase 1
Synonyms:
Cereblon/Histone deacetylase 1 HDAC1 Histone deacetylase 1 (HDAC1) RPD3L1
Type:
Enzyme
Mol. Mass.:
55090.27
Organism:
Homo sapiens (Human)
Description:
Q13547
Residue:
482
  
Inhibitor
Name:
BDBM50320762
Synonyms:
CHEMBL1164063 | N-(2-Aminophenyl)-4-(((biphenyl-4-ylmethyl)(2-hydroxyethyl)amino)ethyl)benzamide
Type:
Small organic molecule
Emp. Form.:
C29H29N3O2
Mol. Mass.:
451.5595
SMILES:
Nc1ccccc1NC(=O)c1ccc(CN(CCO)Cc2ccc(cc2)-c2ccccc2)cc1
: