Target
KiSS-1 receptor
Ligand
BDBM50320816
Substrate
Meas. Tech.
ChEMBL_639178 (CHEMBL1167874)
IC50
45±n/a nM
Citation
 Kobayashi, TSasaki, STomita, NFukui, SKuroda, NNakayama, MKiba, ATakatsu, YOhtaki, TItoh, FBaba, A Synthesis and structure-activity relationships of 2-acylamino-4,6-diphenylpyridine derivatives as novel antagonists of GPR54. Bioorg Med Chem 18:3841-59 (2010)  
Target
Name:
KiSS-1 receptor
Synonyms:
AXOR12 G-protein coupled receptor 54 (GPR54) Hypogonadotropin-1 KISSR_HUMAN Kisspeptins receptor hOT7T175
Type:
G Protein-Coupled Receptor (GPCR)
Mol. Mass.:
42613.79
Organism:
Homo sapiens (Human)
Description:
Binding assay was performed using membranes from the CHO cell transfectants.
Residue:
398
  
Inhibitor
Name:
BDBM50320816
Synonyms:
CHEMBL1165224 | N-(4-(3-(2-aminoethylcarbamoyl)phenyl)-3-cyano-6-(2-hydroxyphenyl)pyridin-2-yl)-2-methoxybenzamide
Type:
Small organic molecule
Emp. Form.:
C29H25N5O4
Mol. Mass.:
507.5399
SMILES:
COc1ccccc1C(=O)Nc1nc(cc(-c2cccc(c2)C(=O)NCCN)c1C#N)-c1ccccc1O
: