Target
C-X-C chemokine receptor type 2
Ligand
BDBM50323040
Substrate
Meas. Tech.
ChEMBL_643613 (CHEMBL1212477)
IC50
>10000±n/a nM
Citation
 Gattinoni, SSimone, CDDallavalle, SFezza, FNannei, RBattista, NMinetti, PQuattrociocchi, GCaprioli, ABorsini, FCabri, WPenco, SMerlini, LMaccarrone, M A new group of oxime carbamates as reversible inhibitors of fatty acid amide hydrolase. Bioorg Med Chem Lett 20:4406-11 (2010)  
Target
Name:
C-X-C chemokine receptor type 2
Synonyms:
C-X-C chemokine receptor type 2 (CXCR-2) CD_antigen=CD182 CXCR-2 CXCR2_HUMAN GRO/MGSA receptor IL-8 receptor type 2 IL8RB | Interleukin-8 receptor B
Type:
Protein
Mol. Mass.:
40767.88
Organism:
Homo sapiens (Human)
Description:
P25025
Residue:
360
  
Inhibitor
Name:
BDBM50323040
Synonyms:
1-(3-Thiophen-2-yl-phenyl)-ethanone, O-(phenylaminocarbonyl)oxime | CHEMBL1210154
Type:
Small organic molecule
Emp. Form.:
C19H16N2O2S
Mol. Mass.:
336.408
SMILES:
CC(=NOC(=O)Nc1ccccc1)c1cccc(c1)-c1cccs1
: