Target
Cytochrome P450 11B1, mitochondrial
Ligand
BDBM50323360
Substrate
Meas. Tech.
ChEMBL_643965 (CHEMBL1211864)
IC50
2±n/a nM
Citation
 Adams, CMHu, CWJeng, AYKarki, RKsander, GLasala, DLeung-Chu, JLiang, GLiu, QMeredith, ERao, CRigel, DFShi, JSmith, SSpringer, CZhang, C The discovery of potent inhibitors of aldosterone synthase that exhibit selectivity over 11-beta-hydroxylase. Bioorg Med Chem Lett 20:4324-7 (2010)  
Target
Name:
Cytochrome P450 11B1, mitochondrial
Synonyms:
C11B1_HUMAN CYPXIB1 Cytochrome P450 11B1 Cytochrome P450 11B1, mitochondrial | S11BH
Type:
Enzyme
Mol. Mass.:
57591.44
Organism:
Homo sapiens (Human)
Description:
P15538
Residue:
503
  
Inhibitor
Name:
BDBM50323360
Synonyms:
4-(7-benzyl-6-oxo-5,6,7,8-tetrahydroimidazo[1,5-a]pyrazin-5-yl)benzonitrile | CHEMBL1209775
Type:
Small organic molecule
Emp. Form.:
C20H16N4O
Mol. Mass.:
328.3672
SMILES:
O=C1C(c2ccc(cc2)C#N)n2cncc2CN1Cc1ccccc1
: