Target
Carbonic anhydrase 6
Ligand
BDBM79403
Substrate
Meas. Tech.
ChEMBL_646959 (CHEMBL1217100)
Ki
990±n/a nM
Citation
 Carta, FTemperini, CInnocenti, AScozzafava, AKaila, KSupuran, CT Polyamines inhibit carbonic anhydrases by anchoring to the zinc-coordinated water molecule. J Med Chem 53:5511-22 (2010)  
Target
Name:
Carbonic anhydrase 6
Synonyms:
CA-VI CAH6_HUMAN Carbonic Anhydrase VI Carbonic anhydrase 6 Carbonic anhydrase 6 (CA-VI) Salivary carbonic anhydrase | Secreted carbonic anhydrase
Type:
Enzyme
Mol. Mass.:
35371.40
Organism:
Homo sapiens (Human)
Description:
P23280
Residue:
308
  
Inhibitor
Name:
BDBM79403
Synonyms:
3-aminopropyl-[4-(3-aminopropylamino)butyl]amine;hydrochloride MLS002472980 N,N''-bis(3-azanylpropyl)butane-1,4-diamine;hydrochloride SMR001397086 cid_5351186 | spermidine 3HCl
Type:
Small organic molecule
Emp. Form.:
C10H26N4
Mol. Mass.:
202.3402
SMILES:
NCCCNCCCCNCCCN
: