Target
Carbonic anhydrase 9
Ligand
BDBM79403
Substrate
Meas. Tech.
ChEMBL_646961 (CHEMBL1217102)
Ki
13300±n/a nM
Citation
 Carta, FTemperini, CInnocenti, AScozzafava, AKaila, KSupuran, CT Polyamines inhibit carbonic anhydrases by anchoring to the zinc-coordinated water molecule. J Med Chem 53:5511-22 (2010)  
Target
Name:
Carbonic anhydrase 9
Synonyms:
CA-IX CAH9_HUMAN Carbonic anhydrase 9 (CA IX) Carbonic anhydrase 9 precursor Carbonic anhydrase IX (CAIX) Carbonic anhydrases; II & IX MN RCC-associated antigen G250
Type:
Enzyme
Mol. Mass.:
49669.03
Organism:
Homo sapiens (Human)
Description:
Catalytic domain of human cloned isozyme was used in the assay
Residue:
459
  
Inhibitor
Name:
BDBM79403
Synonyms:
3-aminopropyl-[4-(3-aminopropylamino)butyl]amine;hydrochloride MLS002472980 N,N''-bis(3-azanylpropyl)butane-1,4-diamine;hydrochloride SMR001397086 cid_5351186 | spermidine 3HCl
Type:
Small organic molecule
Emp. Form.:
C10H26N4
Mol. Mass.:
202.3402
SMILES:
NCCCNCCCCNCCCN
: