Target
Caspase-1
Ligand
BDBM50325238
Substrate
Meas. Tech.
ChEMBL_651931 (CHEMBL1227461)
Ki
2±n/a nM
Citation
 Galatsis, PCaprathe, BDowning, DGilmore, JHarter, WHays, SKostlan, CLinn, KLunney, EPara, KThomas, AWarmus, JAllen, HBrady, KTalanian, RWalker, N Inhibition of interleukin-1beta converting enzyme (ICE or caspase 1) by aspartyl acyloxyalkyl ketones and aspartyl amidooxyalkyl ketones. Bioorg Med Chem Lett 20:5089-94 (2010)  
Target
Name:
Caspase-1
Synonyms:
CASP1 Caspase ICE IL1BCE Interleukin-1 beta-converting enzyme
Type:
Enzyme
Mol. Mass.:
45154.13
Organism:
Homo sapiens (Human)
Description:
P29466
Residue:
404
  
Inhibitor
Name:
BDBM50325238
Synonyms:
(5S,8S,11S)-11-(2-(2-benzyl-3-phenylpropanoyloxy)acetyl)-5-isopropyl-8-methyl-3,6,9-trioxo-1-phenyl-2-oxa-4,7,10-triazatridecan-13-oic acid | CHEMBL1223111
Type:
Small organic molecule
Emp. Form.:
C37H43N3O9
Mol. Mass.:
673.752
SMILES:
CC(C)[C@H](NC(=O)OCc1ccccc1)C(=O)N[C@@H](C)C(=O)N[C@@H](CC(O)=O)C(=O)COC(=O)C(Cc1ccccc1)Cc1ccccc1
: