Target
Cyclin-dependent kinase 2
Ligand
BDBM50326206
Substrate
Meas. Tech.
ChEMBL_659355 (CHEMBL1247982)
IC50
>1000±n/a nM
Citation
 Cee, VJSchenkel, LBHodous, BLDeak, HLNguyen, HNOlivieri, PRRomero, KBak, ABe, XBellon, SBush, TLCheng, ACChung, GCoats, SEden, PMHanestad, KGallant, PLGu, YHuang, XKendall, RLLin, MHMorrison, MJPatel, VFRadinsky, RRose, PERoss, SSun, JRTang, JZhao, HPayton, MGeuns-Meyer, SD Discovery of a potent, selective, and orally bioavailable pyridinyl-pyrimidine phthalazine aurora kinase inhibitor. J Med Chem 53:6368-77 (2010)  
Target
Name:
Cyclin-dependent kinase 2
Synonyms:
CDK2 CDK2_HUMAN Cell division protein kinase 2 Protein cereblon/Cyclin-dependent kinase 2 | p33 protein kinase
Type:
Enzyme Subunit
Mol. Mass.:
33938.17
Organism:
Homo sapiens (Human)
Description:
P24941
Residue:
298
  
Inhibitor
Name:
BDBM50326206
Synonyms:
CHEMBL1243200 | N-(4-(3-(2-(Methylamino)pyrimidin-4-yl)pyridin-2-yloxy)phenyl)-2-(phenylamino)benzamide
Type:
Small organic molecule
Emp. Form.:
C29H24N6O2
Mol. Mass.:
488.5399
SMILES:
CNc1nccc(n1)-c1cccnc1Oc1ccc(NC(=O)c2ccccc2Nc2ccccc2)cc1
: