Target
Sodium/glucose cotransporter 2
Ligand
BDBM50326279
Substrate
Meas. Tech.
ChEMBL_659926 (CHEMBL1247184)
IC50
17±n/a nM
Citation
 Nomura, SSakamaki, SHongu, MKawanishi, EKoga, YSakamoto, TYamamoto, YUeta, KKimata, HNakayama, KTsuda-Tsukimoto, M Discovery of canagliflozin, a novel C-glucoside with thiophene ring, as sodium-dependent glucose cotransporter 2 inhibitor for the treatment of type 2 diabetes mellitus. J Med Chem 53:6355-60 (2010)  
Target
Name:
Sodium/glucose cotransporter 2
Synonyms:
Na(+)/glucose cotransporter 2 SGLT2 Sodium-Dependent Glucose Cotransporter 2 (SGLT2) Solute carrier family 5 member 2
Type:
Protein
Mol. Mass.:
72902.00
Organism:
Homo sapiens (Human)
Description:
P31639
Residue:
672
  
Inhibitor
Name:
BDBM50326279
Synonyms:
1-(beta-D-Glucopyranosyl)-3-(5-ethyl-2-thienylmethyl)benzene | CHEMBL1243207
Type:
Small organic molecule
Emp. Form.:
C19H24O6S
Mol. Mass.:
380.455
SMILES:
CCc1ccc(Cc2ccccc2O[C@@H]2O[C@H](CO)[C@@H](O)[C@H](O)[C@H]2O)s1
: