Target
Vasopressin V1a receptor
Ligand
BDBM50263856
Substrate
Meas. Tech.
ChEMBL_661560 (CHEMBL1253124)
Ki
549±n/a nM
Citation
 Borthwick, AD Oral oxytocin antagonists. J Med Chem 53:6525-38 (2010)  
Target
Name:
Vasopressin V1a receptor
Synonyms:
AVPR V1a AVPR1A V1AR_HUMAN VASOPRESSIN V1A Vasopressin V1 receptor Vasopressin receptor
Type:
Receptor
Mol. Mass.:
46820.18
Organism:
Homo sapiens (Human)
Description:
P37288
Residue:
418
  
Inhibitor
Name:
BDBM50263856
Synonyms:
5-(3-(4-ethoxy-3-methylphenyl)-5-(ethoxymethyl)-4H-1,2,4-triazol-4-yl)-2-methoxypyridine | CHEMBL492029
Type:
Small organic molecule
Emp. Form.:
C20H24N4O3
Mol. Mass.:
368.4296
SMILES:
CCOCc1nnc(-c2ccc(OCC)c(C)c2)n1-c1ccc(OC)nc1
: