Target
G-protein coupled bile acid receptor 1
Ligand
BDBM50327534
Substrate
Meas. Tech.
ChEMBL_664648 (CHEMBL1260362)
IC50
4500±n/a nM
Citation
 Herbert, MRSiegel, DLStaszewski, LCayanan, CBanerjee, UDhamija, SAnderson, JFan, AWang, LRix, PShiau, AKRao, TSNoble, SAHeyman, RABischoff, EGuha, MKabakibi, APinkerton, AB Synthesis and SAR of 2-aryl-3-aminomethylquinolines as agonists of the bile acid receptor TGR5. Bioorg Med Chem Lett 20:5718-21 (2010)  
Target
Name:
G-protein coupled bile acid receptor 1
Synonyms:
BG37 GPBAR_HUMAN TGR5 hGPCR19
Type:
G Protein-Coupled Receptor (GPCR)
Mol. Mass.:
35260.02
Organism:
Homo sapiens (Human)
Description:
CHO cells transiently transfected with hTGR5.
Residue:
330
  
Inhibitor
Name:
BDBM50327534
Synonyms:
2-(4-bromophenyl)-N-((7-ethoxy-2-(thiophen-3-yl)quinolin-3-yl)methyl)ethanamine | CHEMBL1257260
Type:
Small organic molecule
Emp. Form.:
C24H23BrN2OS
Mol. Mass.:
467.421
SMILES:
CCOc1ccc2cc(CNCCc3ccc(Br)cc3)c(nc2c1)-c1ccsc1
: