Target
Alpha-2A adrenergic receptor
Ligand
BDBM50327861
Substrate
Meas. Tech.
ChEMBL_664939 (CHEMBL1259771)
Ki
>10000±n/a nM
Citation
 Xu, RHong, JMorse, CLPike, VW Synthesis, structure-affinity relationships, and radiolabeling of selective high-affinity 5-HT4 receptor ligands as prospective imaging probes for positron emission tomography. J Med Chem 53:7035-47 (2010)  
Target
Name:
Alpha-2A adrenergic receptor
Synonyms:
ADA2A_HUMAN ADRA2R Adrenergic alpha2A Alpha-2 adrenergic receptor subtype C10 Alpha-2A adrenoreceptor alpha-2A adrenergic receptor [Homo sapiens]
Type:
Enzyme
Mol. Mass.:
48979.91
Organism:
Homo sapiens (Human)
Description:
P08913
Residue:
450
  
Inhibitor
Name:
BDBM50327861
Synonyms:
(1-Butylpiperidin-4-yl)methyl 4-Amino-3-methoxybenzoate | CHEMBL1258452
Type:
Small organic molecule
Emp. Form.:
C18H28N2O3
Mol. Mass.:
320.4265
SMILES:
CCCCN1CCC(COC(=O)c2ccc(N)c(OC)c2)CC1
: