Target
D(4) dopamine receptor
Ligand
BDBM50327861
Substrate
Meas. Tech.
ChEMBL_664953 (CHEMBL1259910)
Ki
1272±n/a nM
Citation
 Xu, RHong, JMorse, CLPike, VW Synthesis, structure-affinity relationships, and radiolabeling of selective high-affinity 5-HT4 receptor ligands as prospective imaging probes for positron emission tomography. J Med Chem 53:7035-47 (2010)  
Target
Name:
D(4) dopamine receptor
Synonyms:
D(4) dopamine receptor DOPAMINE D4.4 Dopamine receptor | Drd4
Type:
Enzyme Catalytic Domain
Mol. Mass.:
41307.65
Organism:
RAT
Description:
DOPAMINE D4.4 0 RAT::P30729
Residue:
387
  
Inhibitor
Name:
BDBM50327861
Synonyms:
(1-Butylpiperidin-4-yl)methyl 4-Amino-3-methoxybenzoate | CHEMBL1258452
Type:
Small organic molecule
Emp. Form.:
C18H28N2O3
Mol. Mass.:
320.4265
SMILES:
CCCCN1CCC(COC(=O)c2ccc(N)c(OC)c2)CC1
: