Target
D(1A) dopamine receptor
Ligand
BDBM50328457
Substrate
Meas. Tech.
ChEMBL_665574 (CHEMBL1261458)
Ki
2100±n/a nM
Citation
 Skultety, MHübner, HLöber, SGmeiner, P Bioisosteric replacement leading to biologically active [2.2]paracyclophanes with altered binding profiles for aminergic G-protein-coupled receptors. J Med Chem 53:7219-28 (2010)  
Target
Name:
D(1A) dopamine receptor
Synonyms:
DRD1 Dopamine D1 receptor
Type:
PROTEIN
Mol. Mass.:
49269.92
Organism:
Sus scrofa
Description:
ChEMBL_1460140
Residue:
446
  
Inhibitor
Name:
BDBM50328457
Synonyms:
CHEMBL1258494 | N-[4-[4-(2-Methoxyphenyl)piperazin-1-yl]butyl]-2,5-dimethylbenzamide
Type:
Small organic molecule
Emp. Form.:
C24H33N3O2
Mol. Mass.:
395.5377
SMILES:
COc1ccccc1N1CCN(CCCCNC(=O)c2cc(C)ccc2C)CC1
: