Target
D(2) dopamine receptor
Ligand
BDBM50328457
Substrate
Meas. Tech.
ChEMBL_665575 (CHEMBL1261459)
Ki
22±n/a nM
Citation
 Skultety, MHübner, HLöber, SGmeiner, P Bioisosteric replacement leading to biologically active [2.2]paracyclophanes with altered binding profiles for aminergic G-protein-coupled receptors. J Med Chem 53:7219-28 (2010)  
Target
Name:
D(2) dopamine receptor
Synonyms:
D(2) dopamine receptor DOPAMINE D2 Long DRD2 Dopamine D2 receptor Dopamine D2 receptor (D2R) Dopamine2-like | d2
Type:
Cell-surface receptors
Mol. Mass.:
50647.10
Organism:
Homo sapiens (Human)
Description:
P14416
Residue:
443
  
Inhibitor
Name:
BDBM50328457
Synonyms:
CHEMBL1258494 | N-[4-[4-(2-Methoxyphenyl)piperazin-1-yl]butyl]-2,5-dimethylbenzamide
Type:
Small organic molecule
Emp. Form.:
C24H33N3O2
Mol. Mass.:
395.5377
SMILES:
COc1ccccc1N1CCN(CCCCNC(=O)c2cc(C)ccc2C)CC1
: