Target
Lysosomal Pro-X carboxypeptidase
Ligand
BDBM50328525
Substrate
Meas. Tech.
ChEMBL_665678 (CHEMBL1261609)
IC50
21±n/a nM
Citation
 Zhou, CGarcia-Calvo, MPinto, SLombardo, MFeng, ZBender, KPryor, KDBhatt, URChabin, RMGeissler, WMShen, ZTong, XZhang, ZWong, KKRoy, RSChapman, KTYang, LXiong, Y Design and synthesis of prolylcarboxypeptidase (PrCP) inhibitors to validate PrCP as a potential target for obesity. J Med Chem 53:7251-63 (2010)  
Target
Name:
Lysosomal Pro-X carboxypeptidase
Synonyms:
Angiotensinase C PCP PRCP Prolylcarboxypeptidase | Prolylcarboxypeptidase (PRCP)
Type:
Enzyme
Mol. Mass.:
55805.19
Organism:
Homo sapiens (Human)
Description:
P42785
Residue:
496
  
Inhibitor
Name:
BDBM50328525
Synonyms:
CHEMBL1259221 | N-{(2S,3S)-1-[(2S)-2-(5,6-Dichloro-1H-benzimidazol-2-yl)-pyrrolidin-1-yl]-1-oxo-3-phenylbutan-2-yl}-2-hydroxy-2-methylpropanamide
Type:
Small organic molecule
Emp. Form.:
C25H28Cl2N4O3
Mol. Mass.:
503.421
SMILES:
C[C@H]([C@H](NC(=O)C(C)(C)O)C(=O)N1CCC[C@H]1c1nc2cc(Cl)c(Cl)cc2[nH]1)c1ccccc1
: