Target
Lysosomal Pro-X carboxypeptidase
Ligand
BDBM50328522
Substrate
Meas. Tech.
ChEMBL_665680 (CHEMBL1261611)
IC50
4±n/a nM
Citation
 Zhou, CGarcia-Calvo, MPinto, SLombardo, MFeng, ZBender, KPryor, KDBhatt, URChabin, RMGeissler, WMShen, ZTong, XZhang, ZWong, KKRoy, RSChapman, KTYang, LXiong, Y Design and synthesis of prolylcarboxypeptidase (PrCP) inhibitors to validate PrCP as a potential target for obesity. J Med Chem 53:7251-63 (2010)  
Target
Name:
Lysosomal Pro-X carboxypeptidase
Synonyms:
Angiotensinase C PCP PRCP Prolylcarboxypeptidase | Prolylcarboxypeptidase (PRCP)
Type:
Enzyme
Mol. Mass.:
55805.19
Organism:
Homo sapiens (Human)
Description:
P42785
Residue:
496
  
Inhibitor
Name:
BDBM50328522
Synonyms:
CHEMBL1259179 | N-{(2S)-3-(Biphenyl-4-yl)-1-[(2S)-2-(5-tert-butyl-1H-imidazol-2-yl)pyrrolidin-1-yl]-1-oxopropan-2-yl}-2-hydroxy-2-methylpropanamide
Type:
Small organic molecule
Emp. Form.:
C30H38N4O3
Mol. Mass.:
502.6477
SMILES:
CC(C)(C)c1cnc([nH]1)[C@@H]1CCCN1C(=O)[C@H](Cc1ccc(cc1)-c1ccccc1)NC(=O)C(C)(C)O
: