Target
Lysosomal Pro-X carboxypeptidase
Ligand
BDBM50328539
Substrate
Meas. Tech.
ChEMBL_665681 (CHEMBL1261612)
IC50
41±n/a nM
Citation
 Zhou, CGarcia-Calvo, MPinto, SLombardo, MFeng, ZBender, KPryor, KDBhatt, URChabin, RMGeissler, WMShen, ZTong, XZhang, ZWong, KKRoy, RSChapman, KTYang, LXiong, Y Design and synthesis of prolylcarboxypeptidase (PrCP) inhibitors to validate PrCP as a potential target for obesity. J Med Chem 53:7251-63 (2010)  
Target
Name:
Lysosomal Pro-X carboxypeptidase
Synonyms:
PCP_MOUSE Proline carboxypeptidase | Prolylcarboxypeptidase
Type:
PROTEIN
Mol. Mass.:
55028.96
Organism:
Mus musculus
Description:
ChEMBL_1335505
Residue:
491
  
Inhibitor
Name:
BDBM50328539
Synonyms:
2-Amino-N-{(2S)-3-(biphenyl-4-yl)-1-[(2S)-2-(5-tert-butyl-1Himidazol-2-yl)pyrrolidin-1-yl]-1-oxopropan-2-yl}-2-methylpropanamide | CHEMBL1259178
Type:
Small organic molecule
Emp. Form.:
C30H39N5O2
Mol. Mass.:
501.663
SMILES:
CC(C)(C)c1cnc([nH]1)[C@@H]1CCCN1C(=O)[C@H](Cc1ccc(cc1)-c1ccccc1)NC(=O)C(C)(C)N
: