Target
Lysosomal Pro-X carboxypeptidase
Ligand
BDBM50328558
Substrate
Meas. Tech.
ChEMBL_665678 (CHEMBL1261609)
IC50
122±n/a nM
Citation
 Zhou, CGarcia-Calvo, MPinto, SLombardo, MFeng, ZBender, KPryor, KDBhatt, URChabin, RMGeissler, WMShen, ZTong, XZhang, ZWong, KKRoy, RSChapman, KTYang, LXiong, Y Design and synthesis of prolylcarboxypeptidase (PrCP) inhibitors to validate PrCP as a potential target for obesity. J Med Chem 53:7251-63 (2010)  
Target
Name:
Lysosomal Pro-X carboxypeptidase
Synonyms:
Angiotensinase C PCP PRCP Prolylcarboxypeptidase | Prolylcarboxypeptidase (PRCP)
Type:
Enzyme
Mol. Mass.:
55805.19
Organism:
Homo sapiens (Human)
Description:
P42785
Residue:
496
  
Inhibitor
Name:
BDBM50328558
Synonyms:
3-(2'-Chlorobiphenyl-4-yl)-1-[(2S)-2-(4-phenyl-1H-imidazol-2-yl)pyrrolidin-1-yl]propan-1-one | CHEMBL1259028
Type:
Small organic molecule
Emp. Form.:
C28H26ClN3O
Mol. Mass.:
455.979
SMILES:
Clc1ccccc1-c1ccc(CCC(=O)N2CCC[C@H]2c2nc(c[nH]2)-c2ccccc2)cc1
: