Target
Lysosomal Pro-X carboxypeptidase
Ligand
BDBM50328538
Substrate
Meas. Tech.
ChEMBL_665678 (CHEMBL1261609)
IC50
5±n/a nM
Citation
 Zhou, CGarcia-Calvo, MPinto, SLombardo, MFeng, ZBender, KPryor, KDBhatt, URChabin, RMGeissler, WMShen, ZTong, XZhang, ZWong, KKRoy, RSChapman, KTYang, LXiong, Y Design and synthesis of prolylcarboxypeptidase (PrCP) inhibitors to validate PrCP as a potential target for obesity. J Med Chem 53:7251-63 (2010)  
Target
Name:
Lysosomal Pro-X carboxypeptidase
Synonyms:
Angiotensinase C PCP PRCP Prolylcarboxypeptidase | Prolylcarboxypeptidase (PRCP)
Type:
Enzyme
Mol. Mass.:
55805.19
Organism:
Homo sapiens (Human)
Description:
P42785
Residue:
496
  
Inhibitor
Name:
BDBM50328538
Synonyms:
3-Amino-N-{(2S)-3-(biphenyl-4-yl)-1-[(2S)-2-(5,6-dichloro-1H-benzimidazol-2-yl)pyrrolidin-1-yl]-1-oxopropan-2-yl}-3-methylbutanamide | CHEMBL1259162
Type:
Small organic molecule
Emp. Form.:
C31H33Cl2N5O2
Mol. Mass.:
578.532
SMILES:
CC(C)(N)CC(=O)N[C@@H](Cc1ccc(cc1)-c1ccccc1)C(=O)N1CCC[C@H]1c1nc2cc(Cl)c(Cl)cc2[nH]1
: