Target
PH domain leucine-rich repeat-containing protein phosphatase 2
Ligand
BDBM50328835
Substrate
Meas. Tech.
ChEMBL_673824 (CHEMBL1275001)
IC50
41000±n/a nM
Citation
 Sierecki, ESinko, WMcCammon, JANewton, AC Discovery of small molecule inhibitors of the PH domain leucine-rich repeat protein phosphatase (PHLPP) by chemical and virtual screening. J Med Chem 53:6899-911 (2010)  
Target
Name:
PH domain leucine-rich repeat-containing protein phosphatase 2
Synonyms:
KIAA0931 PHLP2_HUMAN PHLPP2 | PHLPPL
Type:
PROTEIN
Mol. Mass.:
146727.83
Organism:
Homo sapiens (Human)
Description:
ChEMBL_673824
Residue:
1323
  
Inhibitor
Name:
BDBM50328835
Synonyms:
4-(4-acetamidophenylamino)-1-amino-9,10-dioxo-9,10-dihydroanthracene-2-sulfonic acid NSC-366218
Type:
Small organic molecule
Emp. Form.:
C22H17N3O6S
Mol. Mass.:
451.452
SMILES:
CC(=O)Nc1ccc(Nc2cc(c(N)c3C(=O)c4ccccc4C(=O)c23)S(O)(=O)=O)cc1
: