Target
PH domain leucine-rich repeat-containing protein phosphatase 2
Ligand
BDBM50328836
Substrate
Meas. Tech.
ChEMBL_673824 (CHEMBL1275001)
IC50
45000±n/a nM
Citation
 Sierecki, ESinko, WMcCammon, JANewton, AC Discovery of small molecule inhibitors of the PH domain leucine-rich repeat protein phosphatase (PHLPP) by chemical and virtual screening. J Med Chem 53:6899-911 (2010)  
Target
Name:
PH domain leucine-rich repeat-containing protein phosphatase 2
Synonyms:
KIAA0931 PHLP2_HUMAN PHLPP2 | PHLPPL
Type:
PROTEIN
Mol. Mass.:
146727.83
Organism:
Homo sapiens (Human)
Description:
ChEMBL_673824
Residue:
1323
  
Inhibitor
Name:
BDBM50328836
Synonyms:
4-(6-chloro-2-methoxyacridin-9-ylamino)benzoic acid NSC-11404
Type:
Small organic molecule
Emp. Form.:
C21H15ClN2O3
Mol. Mass.:
378.808
SMILES:
COc1ccc2nc3cc(Cl)ccc3c(Nc3ccc(cc3)C(O)=O)c2c1
: