Target
Substance-P receptor
Ligand
BDBM50329161
Substrate
Meas. Tech.
ChEMBL_674420 (CHEMBL1274749)
Ki
0.6±n/a nM
Citation
 Ratni, HBallard, TMBissantz, CHoffmann, TJablonski, PKnoflach, FKnust, HMalherbe, PNettekoven, MPatiny-Adam, ARiemer, CSchmitt, MSpooren, W Rational design of novel pyrrolidine derivatives as orally active neurokinin-3 receptor antagonists. Bioorg Med Chem Lett 20:6735-8 (2010)  
Target
Name:
Substance-P receptor
Synonyms:
NK-1 receptor NK1 Receptor NK1R_HUMAN Neurokinin-1 (NK-1) SPR TACR1 Tachykinin receptor 1 (NK1) | tachykinin
Type:
G Protein-Coupled Receptor (GPCR)
Mol. Mass.:
46254.43
Organism:
Homo sapiens (Human)
Description:
P25103
Residue:
407
  
Inhibitor
Name:
BDBM50329161
Synonyms:
(3R,4S)-3-(2-(3,5-bis(trifluoromethyl)phenyl)-N,2-dimethylpropanamido)-4-(4-fluorophenyl)-N-(2-hydroxyethyl)pyrrolidine-1-carboxamide | CHEMBL1270786
Type:
Small organic molecule
Emp. Form.:
C26H28F7N3O3
Mol. Mass.:
563.5076
SMILES:
CN([C@H]1CN(C[C@@H]1c1ccc(F)cc1)C(=O)NCCO)C(=O)C(C)(C)c1cc(cc(c1)C(F)(F)F)C(F)(F)F
: