Target
Proteinase-activated receptor 1
Ligand
BDBM50329616
Substrate
Meas. Tech.
ChEMBL_675462 (CHEMBL1273599)
Ki
15±n/a nM
Citation
 Xia, YChackalamannil, SGreenlee, WJWang, YHu, ZRoot, YWong, JKong, JAhn, HSBoykow, GHsieh, YKurowski, SChintala, M Discovery of a vorapaxar analog with increased aqueous solubility. Bioorg Med Chem Lett 20:6676-9 (2010)  
Target
Name:
Proteinase-activated receptor 1
Synonyms:
CF2R F2R PAR1 Proteinase activated receptor 1 TR Thrombin receptor/ Proteinase-activated receptor 1(Par-1)
Type:
Protein
Mol. Mass.:
47450.07
Organism:
Homo sapiens (Human)
Description:
P25116
Residue:
425
  
Inhibitor
Name:
BDBM50329616
Synonyms:
CHEMBL1270537 | ethyl(1R,3aR,4aR,6R,8aR,9S,9aS)-9-((E)-2-(5-(2-cyanophenyl)pyridin-2-yl)vinyl)-1-methyl-3-oxododecahydronaphtho[2,3-c]furan-6-ylcarbamate
Type:
Small organic molecule
Emp. Form.:
C30H33N3O4
Mol. Mass.:
499.6007
SMILES:
CCOC(=O)N[C@@H]1CC[C@@H]2[C@H](C[C@@H]3[C@@H]([C@@H](C)OC3=O)[C@H]2C=Cc2ccc(cn2)-c2ccccc2C#N)C1
: