Target
Potassium voltage-gated channel subfamily H member 2
Ligand
BDBM85330
Substrate
Meas. Tech.
ChEMBL_674336 (CHEMBL1274536)
IC50
400±n/a nM
Citation
 Yang, ZFairfax, DJMaeng, JHMasih, LUsyatinsky, AHassler, CIsaacson, SFitzpatrick, KDeOrazio, RJChen, JHarding, JPIsherwood, MDobritsa, SChristensen, KLWierschke, JDBliss, BIPeterson, LHBeer, CMCioffi, CLynch, MRennells, WMRichards, JJRust, TKhmelnitsky, YLCohen, MLManning, DD Discovery of 2-substituted benzoxazole carboxamides as 5-HT3 receptor antagonists. Bioorg Med Chem Lett 20:6538-41 (2010)  
Target
Name:
Potassium voltage-gated channel subfamily H member 2
Synonyms:
1,3-beta-glucan synthase component GLS2 ERG Eag-related protein 1 Ether-a-go-go-related gene (HERG) Ether-a-go-go-related gene potassium channel 1 Ether-a-go-go-related gene potassium channel 1 (hERG1) Ether-a-go-go-related protein 1 H-ERG KCNH2 Potassium voltage-gated channel subfamily H member 2 (hERG) Voltage-gated potassium channel subunit Kv11.1 hERG Potassium Channel 1 | putative potassium channel subunit
Type:
Multi-pass membrane protein
Mol. Mass.:
126672.65
Organism:
Homo sapiens (Human)
Description:
Q12809
Residue:
1159
  
Inhibitor
Name:
BDBM85330
Synonyms:
CAS_68647 ONDANSETRON | Ondansetron hydrochloride
Type:
Small organic molecule
Emp. Form.:
C18H19N3O
Mol. Mass.:
293.363
SMILES:
Cc1nccn1CC1CCc2c(C1=O)c1ccccc1n2C
: