Target
5-hydroxytryptamine receptor 3A
Ligand
BDBM50329734
Substrate
Meas. Tech.
ChEMBL_674333 (CHEMBL1274533)
Ki
18.8±n/a nM
Citation
 Yang, ZFairfax, DJMaeng, JHMasih, LUsyatinsky, AHassler, CIsaacson, SFitzpatrick, KDeOrazio, RJChen, JHarding, JPIsherwood, MDobritsa, SChristensen, KLWierschke, JDBliss, BIPeterson, LHBeer, CMCioffi, CLynch, MRennells, WMRichards, JJRust, TKhmelnitsky, YLCohen, MLManning, DD Discovery of 2-substituted benzoxazole carboxamides as 5-HT3 receptor antagonists. Bioorg Med Chem Lett 20:6538-41 (2010)  
Target
Name:
5-hydroxytryptamine receptor 3A
Synonyms:
5-HT-3 5-HT3A 5-hydroxytryptamine receptor 3 (5-HT3) 5-hydroxytryptamine receptor 3A (5HT3A) 5HT3R HTR3A Serotonin 3 receptor (5HT3) Serotonin-gated ion channel receptor | Serotonin-gated ion channel receptor 3
Type:
Protein
Mol. Mass.:
55283.27
Organism:
Homo sapiens (Human)
Description:
P46098
Residue:
478
  
Inhibitor
Name:
BDBM50329734
Synonyms:
CHEMBL1272231 | endo-2-(4-methoxyphenyl)-N-((1R,5R)-9-methyl-9-azabicyclo[3.3.1]nonan-3-yl)benzo[d]oxazole-4-carboxamide
Type:
Small organic molecule
Emp. Form.:
C24H27N3O3
Mol. Mass.:
405.4895
SMILES:
COc1ccc(cc1)-c1nc2c(cccc2o1)C(=O)NC1C[C@H]2CCC[C@H](C1)N2C
: