Target
5-hydroxytryptamine receptor 3A
Ligand
BDBM50329737
Substrate
Meas. Tech.
ChEMBL_674333 (CHEMBL1274533)
Ki
73.8±n/a nM
Citation
 Yang, ZFairfax, DJMaeng, JHMasih, LUsyatinsky, AHassler, CIsaacson, SFitzpatrick, KDeOrazio, RJChen, JHarding, JPIsherwood, MDobritsa, SChristensen, KLWierschke, JDBliss, BIPeterson, LHBeer, CMCioffi, CLynch, MRennells, WMRichards, JJRust, TKhmelnitsky, YLCohen, MLManning, DD Discovery of 2-substituted benzoxazole carboxamides as 5-HT3 receptor antagonists. Bioorg Med Chem Lett 20:6538-41 (2010)  
Target
Name:
5-hydroxytryptamine receptor 3A
Synonyms:
5-HT-3 5-HT3A 5-hydroxytryptamine receptor 3 (5-HT3) 5-hydroxytryptamine receptor 3A (5HT3A) 5HT3R HTR3A Serotonin 3 receptor (5HT3) Serotonin-gated ion channel receptor | Serotonin-gated ion channel receptor 3
Type:
Protein
Mol. Mass.:
55283.27
Organism:
Homo sapiens (Human)
Description:
P46098
Residue:
478
  
Inhibitor
Name:
BDBM50329737
Synonyms:
CHEMBL1271465 | endo-2-(4-chlorophenyl)-N-((1R,5R)-9-methyl-9-azabicyclo[3.3.1]nonan-3-yl)benzo[d]oxazole-7-carboxamide
Type:
Small organic molecule
Emp. Form.:
C23H24ClN3O2
Mol. Mass.:
409.909
SMILES:
CN1[C@@H]2CCC[C@@H]1CC(C2)NC(=O)c1cccc2nc(oc12)-c1ccc(Cl)cc1
: