Target
5-hydroxytryptamine receptor 3A
Ligand
BDBM50329747
Substrate
Meas. Tech.
ChEMBL_674333 (CHEMBL1274533)
Ki
6.8±n/a nM
Citation
 Yang, ZFairfax, DJMaeng, JHMasih, LUsyatinsky, AHassler, CIsaacson, SFitzpatrick, KDeOrazio, RJChen, JHarding, JPIsherwood, MDobritsa, SChristensen, KLWierschke, JDBliss, BIPeterson, LHBeer, CMCioffi, CLynch, MRennells, WMRichards, JJRust, TKhmelnitsky, YLCohen, MLManning, DD Discovery of 2-substituted benzoxazole carboxamides as 5-HT3 receptor antagonists. Bioorg Med Chem Lett 20:6538-41 (2010)  
Target
Name:
5-hydroxytryptamine receptor 3A
Synonyms:
5-HT-3 5-HT3A 5-hydroxytryptamine receptor 3 (5-HT3) 5-hydroxytryptamine receptor 3A (5HT3A) 5HT3R HTR3A Serotonin 3 receptor (5HT3) Serotonin-gated ion channel receptor | Serotonin-gated ion channel receptor 3
Type:
Protein
Mol. Mass.:
55283.27
Organism:
Homo sapiens (Human)
Description:
P46098
Residue:
478
  
Inhibitor
Name:
BDBM50329747
Synonyms:
2-((3S,5S)-3,5-dimethylmorpholino)-N-((S)-quinuclidin-3-yl)benzo[d]oxazole-4-carboxamide | CHEMBL1271790
Type:
Small organic molecule
Emp. Form.:
C21H28N4O3
Mol. Mass.:
384.472
SMILES:
C[C@H]1COC[C@H](C)N1c1nc2c(cccc2o1)C(=O)N[C@@H]1CN2CCC1CC2
: