Target
Cytochrome P450 3A4
Ligand
BDBM93624
Substrate
Meas. Tech.
ChEMBL_674334 (CHEMBL1274534)
IC50
600±n/a nM
Citation
 Yang, ZFairfax, DJMaeng, JHMasih, LUsyatinsky, AHassler, CIsaacson, SFitzpatrick, KDeOrazio, RJChen, JHarding, JPIsherwood, MDobritsa, SChristensen, KLWierschke, JDBliss, BIPeterson, LHBeer, CMCioffi, CLynch, MRennells, WMRichards, JJRust, TKhmelnitsky, YLCohen, MLManning, DD Discovery of 2-substituted benzoxazole carboxamides as 5-HT3 receptor antagonists. Bioorg Med Chem Lett 20:6538-41 (2010)  
Target
Name:
Cytochrome P450 3A4
Synonyms:
Albendazole monooxygenase CP3A4_HUMAN CYP3A4 CYPIIIA4 Cytochrome P450 3A4 (CYP3A4) Nifedipine oxidase Taurochenodeoxycholate 6-alpha-hydroxylase
Type:
Enzyme
Mol. Mass.:
57349.57
Organism:
Homo sapiens (Human)
Description:
Residue:
503
  
Inhibitor
Name:
BDBM93624
Synonyms:
5-methyl-2-[(5-methyl-1H-imidazol-4-yl)methyl]-3,4-dihydropyrid[4,3-b]indol-1-one;hydrochloride ALOSETRON MLS001401464 cid_60758
Type:
Small organic molecule
Emp. Form.:
C17H18N4O
Mol. Mass.:
294.351
SMILES:
Cc1nc[nH]c1CN1CCc2c(C1=O)c1ccccc1n2C
: