Target
Retinoic acid receptor alpha
Ligand
BDBM50061625
Substrate
Meas. Tech.
ChEMBL_674528 (CHEMBL1274439)
EC50
45±n/a nM
Citation
 Vizirianakis, ISChatzopoulou, MBonovolias, IDNicolaou, IDemopoulos, VJTsiftsoglou, AS Toward the development of innovative bifunctional agents to induce differentiation and to promote apoptosis in leukemia: clinical candidates and perspectives. J Med Chem 53:6779-810 (2010)  
Target
Name:
Retinoic acid receptor alpha
Synonyms:
NR1B1 RAR-alpha RARA_HUMAN Retinoic acid receptor alpha/Retinoid X receptor alpha Retinoid receptor
Type:
PROTEIN
Mol. Mass.:
50778.87
Organism:
Homo sapiens (Human)
Description:
ChEMBL_1466191
Residue:
462
  
Inhibitor
Name:
BDBM50061625
Synonyms:
4-[(5,5,8,8-tetramethyl-5,6,7,8-tetrahydronaphthalen-2-yl)carbamoyl]benzoic acid CHEMBL25202 US11744839, Compound of formula 3 retinobenzoic acid
Type:
Small organic molecule
Emp. Form.:
C22H25NO3
Mol. Mass.:
351.4388
SMILES:
CC1(C)CCC(C)(C)c2cc(NC(=O)c3ccc(cc3)C(O)=O)ccc12
: