Target
Carbonic anhydrase 1
Ligand
BDBM50329823
Substrate
Meas. Tech.
ChEMBL_675712 (CHEMBL1272346)
Kd
7100±n/a nM
Citation
 Capkauskaite, EBaranauskiene, LGolovenko, DManakova, EGražulis, STumkevičius, SMatulis, D Indapamide-like benzenesulfonamides as inhibitors of carbonic anhydrases I, II, VII, and XIII. Bioorg Med Chem 18:7357-64 (2010)  
Target
Name:
Carbonic anhydrase 1
Synonyms:
CA-I CAB Carbonate dehydratase I Carbonic anhydrase 1 (CA I) Carbonic anhydrase 1 (Recombinant CA I) Carbonic anhydrase B Carbonic anhydrase I (CA I) Carbonic anhydrase I (CAI) Carbonic anhydrase isoenzyme I (hCA I) | hCA
Type:
Enzyme
Mol. Mass.:
28873.37
Organism:
Homo sapiens (Human)
Description:
P00915
Residue:
261
  
Inhibitor
Name:
BDBM50329823
Synonyms:
2-Chloro-5-[(2-ethyl-1H-benzimidazol-1-yl)acetyl]benzenesulfonamide N-alkylated benzimidazole derivative, 4e
Type:
Small organic molecule
Emp. Form.:
C17H16ClN3O3S
Mol. Mass.:
377.845
SMILES:
CCc1nc2ccccc2n1CC(=O)c1ccc(Cl)c(c1)S(N)(=O)=O
: